Reaction Details
TargetMothers against decapentaplegic homolog 3
LigandBDBM40304
Substrate/Competitorn/a
Meas. Tech.SMAD Transcription Factor Inhibitors Dose Response Confirmation
IC50 24620±n/a nM
Citation PubChem, PC SMAD Transcription Factor Inhibitors Dose Response Confirmation PubChem Bioassay(2007)[AID]
 
Mothers against decapentaplegic homolog 3
Name:Mothers against decapentaplegic homolog 3
Type:Enzyme Catalytic Domain
Mol. Mass.:48085.78
Organism:Homo sapiens (Human)
Description:gi_5174513
Residue:425
BDBM40304
NameBDBM40304
Synonyms:C-(1-Propyl-1,2,3,4-tetrahydro-quinolin-6-yl)-methylamine SMR000011202 ethanedioic acid;(1-propyl-3,4-dihydro-2H-quinolin-6-yl)methanamine oxalic acid;(1-propyl-3,4-dihydro-2H-quinolin-6-yl)methylamine
TypeSmall organic molecule
Emp. Form.C13H20N2
Mol. Mass.204.3113
SMILESCCCN1CCCc2cc(CN)ccc12