Reaction Details
TargetMothers against decapentaplegic homolog 3
LigandBDBM31698
Substrate/Competitorn/a
Meas. Tech.SMAD Transcription Factor Inhibitors Dose Response Confirmation
IC50 14050±n/a nM
Citation PubChem, PC SMAD Transcription Factor Inhibitors Dose Response Confirmation PubChem Bioassay(2007)[AID]
 
Mothers against decapentaplegic homolog 3
Name:Mothers against decapentaplegic homolog 3
Type:Enzyme Catalytic Domain
Mol. Mass.:48085.78
Organism:Homo sapiens (Human)
Description:gi_5174513
Residue:425
BDBM31698
NameBDBM31698
Synonyms:3-bromanyl-5-(3,3-dimethylpiperidin-1-yl)carbonyl-pyran-2-one 3-bromo-5-[(3,3-dimethyl-1-piperidinyl)-oxomethyl]-2-pyranone SMR000044848 | cid_664033
TypeSmall organic molecule
Emp. Form.C13H16BrNO3
Mol. Mass.314.175
SMILESCC1(C)CCCN(C1)C(=O)c1coc(=O)c(Br)c1