Reaction Details
TargetMothers against decapentaplegic homolog 3
LigandBDBM40309
Substrate/Competitorn/a
Meas. Tech.SMAD Transcription Factor Inhibitors Dose Response Confirmation
IC50 4098±n/a nM
Citation PubChem, PC SMAD Transcription Factor Inhibitors Dose Response Confirmation PubChem Bioassay(2007)[AID]
 
Mothers against decapentaplegic homolog 3
Name:Mothers against decapentaplegic homolog 3
Type:Enzyme Catalytic Domain
Mol. Mass.:48085.78
Organism:Homo sapiens (Human)
Description:gi_5174513
Residue:425
BDBM40309
NameBDBM40309
Synonyms:MLS000046765 N-[3-(1-azepanyl)propyl]-5-[(2-fluorophenyl)methylsulfonylmethyl]-2-furancarboxamide N-[3-(azepan-1-yl)propyl]-5-[(2-fluorophenyl)methylsulfonylmethyl]furan-2-carboxamide cid_3241115
TypeSmall organic molecule
Emp. Form.C22H29FN2O4S
Mol. Mass.436.54
SMILESFc1ccccc1CS(=O)(=O)Cc1ccc(o1)C(=O)NCCCN1CCCCCC1