Reaction Details
TargetMothers against decapentaplegic homolog 3
LigandBDBM40313
Substrate/Competitorn/a
Meas. Tech.SMAD Transcription Factor Inhibitors Dose Response Confirmation
IC50 2000±n/a nM
Citation PubChem, PC SMAD Transcription Factor Inhibitors Dose Response Confirmation PubChem Bioassay(2007)[AID]
 
Mothers against decapentaplegic homolog 3
Name:Mothers against decapentaplegic homolog 3
Type:Enzyme Catalytic Domain
Mol. Mass.:48085.78
Organism:Homo sapiens (Human)
Description:gi_5174513
Residue:425
BDBM40313
NameBDBM40313
Synonyms:3-phenyl-9,10-phenanthrenedione 3-phenylphenanthrene-9,10-quinone SMR000115581 | cid_9549141
TypeSmall organic molecule
Emp. Form.C20H12O2
Mol. Mass.284.3081
SMILESO=C1C(=O)c2ccc(cc2-c2ccccc12)-c1ccccc1