Reaction Details
TargetMothers against decapentaplegic homolog 3
LigandBDBM40314
Substrate/Competitorn/a
Meas. Tech.SMAD Transcription Factor Inhibitors Dose Response Confirmation
IC50 39±n/a nM
Citation PubChem, PC SMAD Transcription Factor Inhibitors Dose Response Confirmation PubChem Bioassay(2007)[AID]
 
Mothers against decapentaplegic homolog 3
Name:Mothers against decapentaplegic homolog 3
Type:Enzyme Catalytic Domain
Mol. Mass.:48085.78
Organism:Homo sapiens (Human)
Description:gi_5174513
Residue:425
BDBM40314
NameBDBM40314
Synonyms:3-(4-Chloro-phenyl)-1,6-dimethyl-1H-pyrimido[5,4-e][1,2,4]triazine-5,7-dione 3-(4-chlorophenyl)-1,6-dimethyl-pyrimido[5,4-e][1,2,4]triazine-5,7-quinone MLS000523518 US9073941, 603 | cid_460749
TypeSmall organic molecule
Emp. Form.C13H10ClN5O2
Mol. Mass.303.704
SMILESCn1nc(nc2c1nc(=O)n(C)c2=O)-c1ccc(Cl)cc1