Reaction Details
TargetMothers against decapentaplegic homolog 3
LigandBDBM40317
Substrate/Competitorn/a
Meas. Tech.SMAD Transcription Factor Inhibitors Dose Response Confirmation
IC50 18540±n/a nM
Citation PubChem, PC SMAD Transcription Factor Inhibitors Dose Response Confirmation PubChem Bioassay(2007)[AID]
 
Mothers against decapentaplegic homolog 3
Name:Mothers against decapentaplegic homolog 3
Type:Enzyme Catalytic Domain
Mol. Mass.:48085.78
Organism:Homo sapiens (Human)
Description:gi_5174513
Residue:425
BDBM40317
NameBDBM40317
Synonyms:2-[(3-methylbenzyl)sulfanyl]-6,7-dihydro-5H-cyclopenta[b]pyridine-3-carbonitrile 2-[(3-methylphenyl)methylsulfanyl]-6,7-dihydro-5H-cyclopenta[b]pyridine-3-carbonitrile MLS000549083 cid_1201887
TypeSmall organic molecule
Emp. Form.C17H16N2S
Mol. Mass.280.387
SMILESCc1cccc(CSc2nc3CCCc3cc2C#N)c1