Reaction Details
TargetMothers against decapentaplegic homolog 3
LigandBDBM40319
Substrate/Competitorn/a
Meas. Tech.SMAD Transcription Factor Inhibitors Dose Response Confirmation
IC50 2815±n/a nM
Citation PubChem, PC SMAD Transcription Factor Inhibitors Dose Response Confirmation PubChem Bioassay(2007)[AID]
 
Mothers against decapentaplegic homolog 3
Name:Mothers against decapentaplegic homolog 3
Type:Enzyme Catalytic Domain
Mol. Mass.:48085.78
Organism:Homo sapiens (Human)
Description:gi_5174513
Residue:425
BDBM40319
NameBDBM40319
Synonyms:4-[(3,4-diketo-1-naphthyl)amino]benzoic acid ethyl ester MLS000519473 cid_691731 ethyl 4-[[3,4-bis(oxidanylidene)naphthalen-1-yl]amino]benzoate
TypeSmall organic molecule
Emp. Form.C19H15NO4
Mol. Mass.321.3267
SMILESCCOC(=O)c1ccc(NC2=CC(=O)C(=O)c3ccccc23)cc1