Reaction Details
TargetCoagulation factor XII
LigandBDBM32794
Substrate/Competitorn/a
Meas. Tech.Factor XIIa Dose Response Confirmation
IC50 2991.11±99.657309 nM
Citation PubChem, PC Factor XIIa Dose Response Confirmation PubChem Bioassay(2008)[AID]
 
Coagulation factor XII
Name:Coagulation factor XII
Type:Enzyme
Mol. Mass.:67810.07
Organism:Homo sapiens (Human)
Description:P00748
Residue:615
BDBM32794
NameBDBM32794
Synonyms:1-benzoyl-3,6,6-trimethyl-1,5,6,7-tetrahydro-4H-indazol-4-one 3,6,6-trimethyl-1-(phenylcarbonyl)-5,7-dihydroindazol-4-one SMR000069174 | cid_749826
TypeSmall organic molecule
Emp. Form.C17H18N2O2
Mol. Mass.282.337
SMILESCc1nn(C(=O)c2ccccc2)c2CC(C)(C)CC(=O)c12