Reaction Details
TargetN-formyl peptide receptor 2
LigandBDBM40421
Substrate/Competitorn/a
Meas. Tech.Formylpeptide Receptor (FPR) Ligand Structure Activity Relationship (SAR) Analysis : Dose Response Assay Counterscreen Against Formyl Peptide Receptor-Like-1 (FPRL1)
Ki>40300±n/a nM
Citation PubChem, PC Formylpeptide Receptor (FPR) Ligand Structure Activity Relationship (SAR) Analysis : Dose Response Assay Counterscreen Against Formyl Peptide Receptor-Like-1 (FPRL1)  PubChem Bioassay(2007)[AID]
 
N-formyl peptide receptor 2
Name:N-formyl peptide receptor 2
Type:G Protein-Coupled Receptor (GPCR)
Mol. Mass.:38968.35
Organism:Homo sapiens (Human)
Description:P25090
Residue:351
BDBM40421
NameBDBM40421
Synonyms:3-(furan-2-carbonyl)-4-hydroxy-1-(3-imidazol-1-ylpropyl)-2-pyridin-3-yl-2H-pyrrol-5-one 3-[2-furanyl(oxo)methyl]-4-hydroxy-1-[3-(1-imidazolyl)propyl]-2-(3-pyridinyl)-2H-pyrrol-5-one UNM000003552901 | cid_2909036
TypeSmall organic molecule
Emp. Form.C20H18N4O4
Mol. Mass.378.3813
SMILESO=C(C1C(N(CCCn2ccnc2)C(=O)C1=O)c1cccnc1)c1ccco1