Reaction Details
TargetfMet-Leu-Phe receptor
LigandBDBM40402
Substrate/Competitorn/a
Meas. Tech.Formylpeptide Receptor (FPR) Ligand Structure Activity Relationship (SAR) Analysis : Dose Response Assay
Ki 1100±n/a nM
Citation PubChem, PC Formylpeptide Receptor (FPR) Ligand Structure Activity Relationship (SAR) Analysis : Dose Response Assay PubChem Bioassay(2007)[AID]
 
fMet-Leu-Phe receptor
Name:fMet-Leu-Phe receptor
Type:Enzyme Catalytic Domain
Mol. Mass.:38456.14
Organism:Homo sapiens (Human)
Description:gi_4503779
Residue:350
BDBM40402
NameBDBM40402
Synonyms:2-furancarboxylic acid [3-(2-methoxyphenyl)-4-oxo-2-(trifluoromethyl)-1-benzopyran-7-yl] ester [3-(2-methoxyphenyl)-4-oxidanylidene-2-(trifluoromethyl)chromen-7-yl] furan-2-carboxylate cid_1185399 | furan-2-carboxylic acid [4-keto-3-(2-methoxyphenyl)-2-(trifluoromethyl)chromen-7-yl] ester
TypeSmall organic molecule
Emp. Form.C22H13F3O6
Mol. Mass.430.3302
SMILESCOc1ccccc1-c1c(oc2cc(OC(=O)c3ccco3)ccc2c1=O)C(F)(F)F