Reaction Details
TargetfMet-Leu-Phe receptor
LigandBDBM40404
Substrate/Competitorn/a
Meas. Tech.Formylpeptide Receptor (FPR) Ligand Structure Activity Relationship (SAR) Analysis : Dose Response Assay
Ki 300±n/a nM
Citation PubChem, PC Formylpeptide Receptor (FPR) Ligand Structure Activity Relationship (SAR) Analysis : Dose Response Assay PubChem Bioassay(2007)[AID]
 
fMet-Leu-Phe receptor
Name:fMet-Leu-Phe receptor
Type:Enzyme Catalytic Domain
Mol. Mass.:38456.14
Organism:Homo sapiens (Human)
Description:gi_4503779
Residue:350
BDBM40404
NameBDBM40404
Synonyms:UNM000003536701 [6-ethyl-2-methyl-3-(1-methylbenzimidazol-2-yl)-4-oxochromen-7-yl] acetate acetic acid [6-ethyl-4-keto-2-methyl-3-(1-methylbenzimidazol-2-yl)chromen-7-yl] ester | cid_3092570
TypeSmall organic molecule
Emp. Form.C22H20N2O4
Mol. Mass.376.4052
SMILESCCc1cc2c(cc1OC(C)=O)oc(C)c(-c1nc3ccccc3n1C)c2=O