Reaction Details
TargetfMet-Leu-Phe receptor
LigandBDBM40406
Substrate/Competitorn/a
Meas. Tech.Formylpeptide Receptor (FPR) Ligand Structure Activity Relationship (SAR) Analysis : Dose Response Assay
Ki 1800±n/a nM
Citation PubChem, PC Formylpeptide Receptor (FPR) Ligand Structure Activity Relationship (SAR) Analysis : Dose Response Assay PubChem Bioassay(2007)[AID]
 
fMet-Leu-Phe receptor
Name:fMet-Leu-Phe receptor
Type:Enzyme Catalytic Domain
Mol. Mass.:38456.14
Organism:Homo sapiens (Human)
Description:gi_4503779
Residue:350
BDBM40406
NameBDBM40406
Synonyms:(4E)-5-(2,5-dimethoxyphenyl)-1-(2-methoxyethyl)-4-[oxidanyl(phenyl)methylidene]pyrrolidine-2,3-dione (4E)-5-(2,5-dimethoxyphenyl)-4-[hydroxy(phenyl)methylidene]-1-(2-methoxyethyl)pyrrolidine-2,3-dione cid_5291419
TypeSmall organic molecule
Emp. Form.C22H23NO6
Mol. Mass.397.4211
SMILESCOCCN1C(C(C(=O)c2ccccc2)C(=O)C1=O)c1cc(OC)ccc1OC