Reaction Details
TargetfMet-Leu-Phe receptor
LigandBDBM50183472
Substrate/Competitorn/a
Meas. Tech.Formylpeptide Receptor (FPR) Ligand Structure Activity Relationship (SAR) Analysis : Dose Response Assay
Ki 6400±n/a nM
Citation PubChem, PC Formylpeptide Receptor (FPR) Ligand Structure Activity Relationship (SAR) Analysis : Dose Response Assay PubChem Bioassay(2007)[AID]
 
fMet-Leu-Phe receptor
Name:fMet-Leu-Phe receptor
Type:Enzyme Catalytic Domain
Mol. Mass.:38456.14
Organism:Homo sapiens (Human)
Description:gi_4503779
Residue:350
BDBM50183472
NameBDBM50183472
Synonyms:5-(2,4-dimethoxyphenyl)-4-(furan-2-carbonyl)-3-hydroxy-1-(2-morpholinoethyl)-1H-pyrrol-2(5H)-one cid_2909444
TypeSmall organic molecule
Emp. Form.C23H26N2O7
Mol. Mass.442.4617
SMILESCOc1ccc(C2C(C(=O)c3ccco3)C(=O)C(=O)N2CCN2CCOCC2)c(OC)c1