Reaction Details
TargetN-formyl peptide receptor 2
LigandBDBM37686
Substrate/Competitorn/a
Meas. Tech.Formylpeptide Receptor (FPRL1) Ligand Structure Activity Relationship (SAR) Analysis : Dose Response Assay
IC50 16500±n/a nM
Citation PubChem, PC Formylpeptide Receptor (FPRL1) Ligand Structure Activity Relationship (SAR) Analysis : Dose Response Assay PubChem Bioassay(2007)[AID]
 
N-formyl peptide receptor 2
Name:N-formyl peptide receptor 2
Type:G Protein-Coupled Receptor (GPCR)
Mol. Mass.:38968.35
Organism:Homo sapiens (Human)
Description:P25090
Residue:351
BDBM37686
NameBDBM37686
Synonyms:2-(4-benzylpiperazin-1-yl)-4-(3,4-dimethoxyphenyl)-6-(trifluoromethyl)pyrimidine 4-(3,4-dimethoxyphenyl)-2-[4-(phenylmethyl)-1-piperazinyl]-6-(trifluoromethyl)pyrimidine MLS000044552 cid_2992722
TypeSmall organic molecule
Emp. Form.C24H25F3N4O2
Mol. Mass.458.4761
SMILESCOc1ccc(cc1OC)-c1cc(nc(n1)N1CCN(Cc2ccccc2)CC1)C(F)(F)F