Reaction Details
TargetN-formyl peptide receptor 2
LigandBDBM40751
Substrate/Competitorn/a
Meas. Tech.Formylpeptide Receptor (FPRL1) Ligand Structure Activity Relationship (SAR) Analysis : Dose Response Assay
IC50>61000±n/a nM
Citation PubChem, PC Formylpeptide Receptor (FPRL1) Ligand Structure Activity Relationship (SAR) Analysis : Dose Response Assay PubChem Bioassay(2007)[AID]
 
N-formyl peptide receptor 2
Name:N-formyl peptide receptor 2
Type:G Protein-Coupled Receptor (GPCR)
Mol. Mass.:38968.35
Organism:Homo sapiens (Human)
Description:P25090
Residue:351
BDBM40751
NameBDBM40751
Synonyms:2-cyclohexyl-N-(5-imidazo[1,2-a]pyrimidin-2-yl-2-methoxy-phenyl)acetamide 2-cyclohexyl-N-(5-imidazo[1,2-a]pyrimidin-2-yl-2-methoxyphenyl)acetamide UNM000003658201 | cid_7080254
TypeSmall organic molecule
Emp. Form.C21H24N4O2
Mol. Mass.364.4409
SMILESCOc1ccc(cc1NC(=O)CC1CCCCC1)-c1cn2cccnc2n1