Reaction Details
TargetBeta-hexosaminidase subunit beta
LigandBDBM40760
Substrate/Competitorn/a
Meas. Tech.Inhibition Assay
Ki 65±0.0 nM
Citation Liu, JShikhman, ARLotz, MKWong, CH Hexosaminidase inhibitors as new drug candidates for the therapy of osteoarthritis. Chem Biol8:701-11 (2001) 
 
Beta-hexosaminidase subunit beta
Name:Beta-hexosaminidase subunit beta
Type:Enzyme
Mol. Mass.:63112.58
Organism:Homo sapiens (Human)
Description:P07686
Residue:556
BDBM40760
NameBDBM40760
Synonyms:Iminocyclitol, 2
TypeSmall organic molecule
Emp. Form.C8H16N2O4
Mol. Mass.204.2236
SMILESCN1[C@H](CO)[C@@H](O)[C@H](O)[C@@H]1NC(C)=O