Reaction Details
TargetBeta-hexosaminidase subunit beta
LigandBDBM50182804
Substrate/Competitorn/a
Meas. Tech.Inhibition Assay
Ki 1200±0.0 nM
Citation Liu, JShikhman, ARLotz, MKWong, CH Hexosaminidase inhibitors as new drug candidates for the therapy of osteoarthritis. Chem Biol8:701-11 (2001) 
 
Beta-hexosaminidase subunit beta
Name:Beta-hexosaminidase subunit beta
Type:Enzyme
Mol. Mass.:63112.58
Organism:Homo sapiens (Human)
Description:P07686
Residue:556
BDBM50182804
NameBDBM50182804
Synonyms:2-ACETAMIDO-1,2-DIDEOXYNOJIRMYCIN Iminocyclitol, 5 N-[4,5-dihydroxy-6-(hydroxymethyl)piperidin-3-yl]acetamide, 1
TypeSmall organic molecule
Emp. Form.C8H16N2O4
Mol. Mass.204.2236
SMILESCC(=O)N[C@H]1CN[C@H](CO)[C@@H](O)[C@@H]1O