Reaction Details
TargetHeat shock 70 kDa protein 1A
LigandBDBM31701
Substrate/Competitorn/a
Meas. Tech.TR-FRET secondary assay for HTS discovery of chemical inhibitors of Hsp70
IC50>100000±0 nM
Citation PubChem, PC TR-FRET secondary assay for HTS discovery of chemical inhibitors of Hsp70 PubChem Bioassay(2008)[AID]
 
Heat shock 70 kDa protein 1A
Name:Heat shock 70 kDa protein 1A
Type:ATP-binding protein
Mol. Mass.:51937.99
Organism:Homo sapiens (Human)
Description:gi_123271505; GST-tagged ATPase domain
Residue:476
BDBM31701
NameBDBM31701
Synonyms:3-(2-furanyl)-N-(3-methoxypropyl)-3-[(4-methylphenyl)sulfonylamino]propanamide 3-(2-furyl)-N-(3-methoxypropyl)-3-{[(4-methylphenyl)sulfonyl]amino}propanamide MLS000047323 cid_3239172
TypeSmall organic molecule
Emp. Form.C18H24N2O5S
Mol. Mass.380.459
SMILESCOCCCNC(=O)CC(NS(=O)(=O)c1ccc(C)cc1)c1ccco1