Reaction Details
TargetHeat shock 70 kDa protein 1A
LigandBDBM31712
Substrate/Competitorn/a
Meas. Tech.TR-FRET secondary assay for HTS discovery of chemical inhibitors of Hsp70
IC50 19200±3690 nM
Citation PubChem, PC TR-FRET secondary assay for HTS discovery of chemical inhibitors of Hsp70 PubChem Bioassay(2008)[AID]
 
Heat shock 70 kDa protein 1A
Name:Heat shock 70 kDa protein 1A
Type:ATP-binding protein
Mol. Mass.:51937.99
Organism:Homo sapiens (Human)
Description:gi_123271505; GST-tagged ATPase domain
Residue:476
BDBM31712
NameBDBM31712
Synonyms:HEXACHLOROPHENE MLS000028433 cid_3598
TypeSmall organic molecule
Emp. Form.C13H6Cl6O2
Mol. Mass.406.904
SMILESOc1c(Cl)cc(Cl)c(Cl)c1Cc1c(O)c(Cl)cc(Cl)c1Cl