Reaction Details
TargetHeat shock 70 kDa protein 1A
LigandBDBM31717
Substrate/Competitorn/a
Meas. Tech.TR-FRET secondary assay for HTS discovery of chemical inhibitors of Hsp70
IC50>100000±0 nM
Citation PubChem, PC TR-FRET secondary assay for HTS discovery of chemical inhibitors of Hsp70 PubChem Bioassay(2008)[AID]
 
Heat shock 70 kDa protein 1A
Name:Heat shock 70 kDa protein 1A
Type:ATP-binding protein
Mol. Mass.:51937.99
Organism:Homo sapiens (Human)
Description:gi_123271505; GST-tagged ATPase domain
Residue:476
BDBM31717
NameBDBM31717
Synonyms:MLS000521411 [4-[(2-hydroxybenzoyl)diazenyl]anilino] benzoate benzoic acid (4-salicyloylazoanilino) ester cid_4483668
TypeSmall organic molecule
Emp. Form.C20H15N3O4
Mol. Mass.361.3508
SMILESOc1ccccc1C(=O)\N=N\c1ccc(NOC(=O)c2ccccc2)cc1