Reaction Details
TargetComplement C1s subcomponent
LigandBDBM40792
Substrate/Competitorn/a
Meas. Tech.Complement factor C1s IC50 from mixture screen
IC50>50000±0 nM
Citation PubChem, PC Complement factor C1s IC50 from mixture screen PubChem Bioassay(2008)[AID]
 
Complement C1s subcomponent
Name:Complement C1s subcomponent
Type:Protein
Mol. Mass.:76657.91
Organism:Homo sapiens (Human)
Description:P09871
Residue:688
BDBM40792
NameBDBM40792
Synonyms:2-[1,3-benzodioxol-5-ylmethyl-[2-(1-benzotriazolyl)-1-oxoethyl]amino]-N-tert-butyl-2-(2-furanyl)acetamide 2-[1,3-benzodioxol-5-ylmethyl-[2-(benzotriazol-1-yl)ethanoyl]amino]-N-tert-butyl-2-(furan-2-yl)ethanamide 2-[[2-(benzotriazol-1-yl)acetyl]-piperonyl-amino]-N-tert-butyl-2-(2-furyl)acetamide SMR000003147 | cid_646921
TypeSmall organic molecule
Emp. Form.C26H27N5O5
Mol. Mass.489.5231
SMILESCC(C)(C)NC(=O)C(N(Cc1ccc2OCOc2c1)C(=O)Cn1nnc2ccccc12)c1ccco1