Reaction Details
TargetComplement C1s subcomponent
LigandBDBM32758
Substrate/Competitorn/a
Meas. Tech.Complement factor C1s IC50 from mixture screen
IC50 8540±920 nM
Citation PubChem, PC Complement factor C1s IC50 from mixture screen PubChem Bioassay(2008)[AID]
 
Complement C1s subcomponent
Name:Complement C1s subcomponent
Type:Protein
Mol. Mass.:76657.91
Organism:Homo sapiens (Human)
Description:P09871
Residue:688
BDBM32758
NameBDBM32758
Synonyms:1,3-Bis-(furan-2-carbonyl)-5-methyl-2-oxo-2,3-dihydro-1H-imidazole-4-carboxylic acid ethyl ester 1,3-bis[2-furanyl(oxo)methyl]-5-methyl-2-oxo-4-imidazolecarboxylic acid ethyl ester SMR000010623 ethyl 1,3-bis(furan-2-carbonyl)-5-methyl-2-oxoimidazole-4-carboxylate | ethyl 1,3-bis(furan-2-ylcarbonyl)-5-methyl-2-oxidanylidene-imidazole-4-carboxylate
TypeSmall organic molecule
Emp. Form.C17H14N2O7
Mol. Mass.358.3023
SMILESCCOC(=O)c1c(C)n(C(=O)c2ccco2)c(=O)n1C(=O)c1ccco1