Reaction Details
TargetComplement C1s subcomponent
LigandBDBM40804
Substrate/Competitorn/a
Meas. Tech.Complement factor C1s IC50 from mixture screen
IC50>50000±0 nM
Citation PubChem, PC Complement factor C1s IC50 from mixture screen PubChem Bioassay(2008)[AID]
 
Complement C1s subcomponent
Name:Complement C1s subcomponent
Type:Protein
Mol. Mass.:76657.91
Organism:Homo sapiens (Human)
Description:P09871
Residue:688
BDBM40804
NameBDBM40804
Synonyms:2-(6-amino-1'-benzyl-5-cyano-2'-keto-spiro[2H-pyrano[2,3-c]pyrazole-4,3'-indoline]-3-yl)acetic acid methyl ester MLS000075271 cid_654660 methyl 2-[6-azanyl-5-cyano-2'-oxidanylidene-1'-(phenylmethyl)spiro[2H-pyrano[2,3-c]pyrazole-4,3'-indole]-3-yl]ethanoate
TypeSmall organic molecule
Emp. Form.C24H19N5O4
Mol. Mass.441.4388
SMILESCOC(=O)Cc1n[nH]c2OC(=N)C(C#N)C3(C(=O)N(Cc4ccccc4)c4ccccc34)c12