Reaction Details
TargetComplement C1s subcomponent
LigandBDBM40493
Substrate/Competitorn/a
Meas. Tech.Complement factor C1s IC50 from mixture screen
IC50>50000±0 nM
Citation PubChem, PC Complement factor C1s IC50 from mixture screen PubChem Bioassay(2008)[AID]
 
Complement C1s subcomponent
Name:Complement C1s subcomponent
Type:Protein
Mol. Mass.:76657.91
Organism:Homo sapiens (Human)
Description:P09871
Residue:688
BDBM40493
NameBDBM40493
Synonyms:HEXESTROL DIPROPIONATE SMR000058378 cid_107342 propionic acid [4-[1-ethyl-2-(4-propionyloxyphenyl)butyl]phenyl] ester
TypeSmall organic molecule
Emp. Form.C24H30O4
Mol. Mass.382.4926
SMILESCCC(C(CC)c1ccc(OC(=O)CC)cc1)c1ccc(OC(=O)CC)cc1