Reaction Details
TargetComplement C1s subcomponent
LigandBDBM32796
Substrate/Competitorn/a
Meas. Tech.Complement factor C1s IC50 from mixture screen
IC50 900±120 nM
Citation PubChem, PC Complement factor C1s IC50 from mixture screen PubChem Bioassay(2008)[AID]
 
Complement C1s subcomponent
Name:Complement C1s subcomponent
Type:Protein
Mol. Mass.:76657.91
Organism:Homo sapiens (Human)
Description:P09871
Residue:688
BDBM32796
NameBDBM32796
Synonyms:MLS000115326 [3-(2-furanyl)-5-(methylthio)-1,2,4-triazol-1-yl]-(4-methylphenyl)methanone [3-(furan-2-yl)-5-methylsulfanyl-1,2,4-triazol-1-yl]-(4-methylphenyl)methanone | cid_1088428
TypeSmall organic molecule
Emp. Form.C15H13N3O2S
Mol. Mass.299.348
SMILESCSc1nc(nn1C(=O)c1ccc(C)cc1)-c1ccco1