Reaction Details
TargetFocal adhesion kinase 1
LigandBDBM40943
Substrate/Competitorn/a
Meas. Tech.Dose-response biochemical assay for inhibitors of Focal Adhesion Kinase (FAK)
IC50 12520±n/a nM
Citation PubChem, PC Dose-response biochemical assay for inhibitors of Focal Adhesion Kinase (FAK) PubChem Bioassay(2007)[AID]
 
Focal adhesion kinase 1
Name:Focal adhesion kinase 1
Type:Tyrosine-protein kinase
Mol. Mass.:119233.17
Organism:Homo sapiens (Human)
Description:Q05397
Residue:1052
BDBM40943
NameBDBM40943
Synonyms:(2-Isopropyl-quinazolin-4-ylsulfanyl)-acetic acid methyl ester 2-[(2-propan-2-yl-4-quinazolinyl)thio]acetic acid methyl ester SMR000006837 methyl 2-(2-propan-2-ylquinazolin-4-yl)sulfanylacetate | methyl 2-(2-propan-2-ylquinazolin-4-yl)sulfanylethanoate
TypeSmall organic molecule
Emp. Form.C14H16N2O2S
Mol. Mass.276.354
SMILESCOC(=O)CSc1nc(nc2ccccc12)C(C)C