Reaction Details
TargetFocal adhesion kinase 1
LigandBDBM32280
Substrate/Competitorn/a
Meas. Tech.Dose-response biochemical assay for inhibitors of Focal Adhesion Kinase (FAK)
IC50 2395±n/a nM
Citation PubChem, PC Dose-response biochemical assay for inhibitors of Focal Adhesion Kinase (FAK) PubChem Bioassay(2007)[AID]
 
Focal adhesion kinase 1
Name:Focal adhesion kinase 1
Type:Tyrosine-protein kinase
Mol. Mass.:119233.17
Organism:Homo sapiens (Human)
Description:Q05397
Residue:1052
BDBM32280
NameBDBM32280
Synonyms:MLS000534769 N-(4-acetylphenyl)-2,3-bis(2-furyl)quinoxaline-6-carboxamide N-(4-acetylphenyl)-2,3-di-2-furyl-6-quinoxalinecarboxamide SMR000142225 | cid_1331726
TypeSmall organic molecule
Emp. Form.C25H17N3O4
Mol. Mass.423.4202
SMILESCC(=O)c1ccc(NC(=O)c2ccc3nc(-c4ccco4)c(nc3c2)-c2ccco2)cc1