Reaction Details
TargetFocal adhesion kinase 1
LigandBDBM50106345
Substrate/Competitorn/a
Meas. Tech.Dose-response biochemical assay for inhibitors of Focal Adhesion Kinase (FAK)
IC50 2749±n/a nM
Citation PubChem, PC Dose-response biochemical assay for inhibitors of Focal Adhesion Kinase (FAK) PubChem Bioassay(2007)[AID]
 
Focal adhesion kinase 1
Name:Focal adhesion kinase 1
Type:Tyrosine-protein kinase
Mol. Mass.:119233.17
Organism:Homo sapiens (Human)
Description:Q05397
Residue:1052
BDBM50106345
NameBDBM50106345
Synonyms:4-(4-Methyl-piperazin-1-yl)-phenylamine cid_737253
TypeSmall organic molecule
Emp. Form.C11H17N3
Mol. Mass.191.2728
SMILESCN1CCN(CC1)c1ccc(N)cc1