Reaction Details
TargetCathepsin B
LigandBDBM32102
Substrate/Competitorn/a
Meas. Tech.Cathepsin B dose-response confirmation
IC50 46.1±2.6 nM
Citation PubChem, PC Cathepsin B dose-response confirmation PubChem Bioassay(2008)[AID]
 
Cathepsin B
Name:Cathepsin B
Type:Enzyme
Mol. Mass.:37819.69
Organism:Homo sapiens (Human)
Description:gi_63102437
Residue:339
BDBM32102
NameBDBM32102
Synonyms:1,6-dimethylpyrimido[5,4-e][1,2,4]triazine-5,7(1H,6H)-dione 1,6-dimethylpyrimido[5,4-e][1,2,4]triazine-5,7-quinone SMR000024051 US9738628, Compound PKF118-310 | cid_66541
TypeSmall organic molecule
Emp. Form.C7H7N5O2
Mol. Mass.193.1628
SMILESCn1ncnc2c1nc(=O)n(C)c2=O