Reaction Details
TargetDNA-directed RNA polymerase subunit beta
LigandBDBM41203
Substrate/Competitorn/a
Meas. Tech.RNA polymerase dose-response confirmation
IC50>50000±0 nM
Citation PubChem, PC RNA polymerase dose-response confirmation PubChem Bioassay(2008)[AID]
 
DNA-directed RNA polymerase subunit beta
Name:DNA-directed RNA polymerase subunit beta
Synonyms:RNA polymerase beta subunit (EC 2.7.7.6)
Type:Enzyme Catalytic Domain
Mol. Mass.:150595.80
Organism:Escherichia coli
Description:A0A0E2LB94
Residue:1342
BDBM41203
NameBDBM41203
TypeSmall organic molecule
Emp. Form.C19H24N6O3S2
Mol. Mass.448.562
SMILESCCCn1c(SCC(=O)Nc2nc3CCCCc3s2)nc2n(C)c(=O)n(C)c(=O)c12