Reaction Details
TargetDNA-directed RNA polymerase subunit beta
LigandBDBM32022
Substrate/Competitorn/a
Meas. Tech.RNA polymerase dose-response confirmation
IC50 14374.7±533.051 nM
Citation PubChem, PC RNA polymerase dose-response confirmation PubChem Bioassay(2008)[AID]
 
DNA-directed RNA polymerase subunit beta
Name:DNA-directed RNA polymerase subunit beta
Synonyms:RNA polymerase beta subunit (EC 2.7.7.6)
Type:Enzyme Catalytic Domain
Mol. Mass.:150595.80
Organism:Escherichia coli
Description:A0A0E2LB94
Residue:1342
BDBM32022
NameBDBM32022
TypeSmall organic molecule
Emp. Form.C27H29NO11
Mol. Mass.543.5193
SMILESCOc1cccc2C(=O)c3c(O)c4C[C@](O)(C[C@H](O[C@H]5C[C@H](N)[C@H](O)[C@H](C)O5)c4c(O)c3C(=O)c12)C(=O)CO