Reaction Details
TargetDNA-directed RNA polymerase subunit beta
LigandBDBM41221
Substrate/Competitorn/a
Meas. Tech.RNA polymerase dose-response confirmation
IC50 17605.2±1135.58 nM
Citation PubChem, PC RNA polymerase dose-response confirmation PubChem Bioassay(2008)[AID]
 
DNA-directed RNA polymerase subunit beta
Name:DNA-directed RNA polymerase subunit beta
Synonyms:RNA polymerase beta subunit (EC 2.7.7.6)
Type:Enzyme Catalytic Domain
Mol. Mass.:150595.80
Organism:Escherichia coli
Description:A0A0E2LB94
Residue:1342
BDBM41221
NameBDBM41221
TypeSmall organic molecule
Emp. Form.C10H15NO
Mol. Mass.165.2322
SMILESCCC(C)c1ccc(O)c(N)c1