Reaction Details
TargetPantothenate synthetase
LigandBDBM41548
Substrate/Competitorn/a
Meas. Tech.Mycobacterium tuberculosis Pantothenate Synthetase Secondary Assay
IC50 108.2±n/a nM
Citation PubChem, PC Mycobacterium tuberculosis Pantothenate Synthetase Secondary Assay PubChem Bioassay(2007)[AID]
 
Pantothenate synthetase
Name:Pantothenate synthetase
Type:n/a
Mol. Mass.:32675.10
Organism:Mycobacterium tuberculosis (strain ATCC 25618 / H37Rv)
Description:ChEMBL_102878
Residue:309
BDBM41548
NameBDBM41548
Synonyms:AB00514735 N-[1-[(4-fluorophenyl)methyl]-4-pyrazolyl]-5-phenyl-1,2-benzoxazole-3-carboxamide cid_16740884
TypeSmall organic molecule
Emp. Form.C24H17FN4O2
Mol. Mass.412.4158
SMILESFc1ccc(Cn2cc(NC(=O)c3noc4ccc(cc34)-c3ccccc3)cn2)cc1