Reaction Details
TargetPantothenate synthetase
LigandBDBM41551
Substrate/Competitorn/a
Meas. Tech.Mycobacterium tuberculosis Pantothenate Synthetase Secondary Assay
IC50 0.101±n/a nM
Citation PubChem, PC Mycobacterium tuberculosis Pantothenate Synthetase Secondary Assay PubChem Bioassay(2007)[AID]
 
Pantothenate synthetase
Name:Pantothenate synthetase
Type:n/a
Mol. Mass.:32675.10
Organism:Mycobacterium tuberculosis (strain ATCC 25618 / H37Rv)
Description:ChEMBL_102878
Residue:309
BDBM41551
NameBDBM41551
Synonyms:5-tert-butyl-N-[1-(3-iodobenzyl)pyrazol-4-yl]-4,5,6,7-tetrahydroindoxazene-3-carboxamide 5-tert-butyl-N-[1-[(3-iodophenyl)methyl]-4-pyrazolyl]-4,5,6,7-tetrahydro-1,2-benzoxazole-3-carboxamide AB00538131 | cid_16740887
TypeSmall organic molecule
Emp. Form.C22H25IN4O2
Mol. Mass.504.364
SMILESCC(C)(C)C1CCc2onc(C(=O)Nc3cnn(Cc4cccc(I)c4)c3)c2C1