Reaction Details
TargetPantothenate synthetase
LigandBDBM41552
Substrate/Competitorn/a
Meas. Tech.Mycobacterium tuberculosis Pantothenate Synthetase Secondary Assay
IC50 0.104±n/a nM
Citation PubChem, PC Mycobacterium tuberculosis Pantothenate Synthetase Secondary Assay PubChem Bioassay(2007)[AID]
 
Pantothenate synthetase
Name:Pantothenate synthetase
Type:n/a
Mol. Mass.:32675.10
Organism:Mycobacterium tuberculosis (strain ATCC 25618 / H37Rv)
Description:ChEMBL_102878
Residue:309
BDBM41552
NameBDBM41552
Synonyms:5-tert-butyl-N-[1-(2-iodobenzyl)pyrazol-4-yl]-4,5,6,7-tetrahydroindoxazene-3-carboxamide 5-tert-butyl-N-[1-[(2-iodophenyl)methyl]-4-pyrazolyl]-4,5,6,7-tetrahydro-1,2-benzoxazole-3-carboxamide AB00538132 | cid_16740888
TypeSmall organic molecule
Emp. Form.C22H25IN4O2
Mol. Mass.504.364
SMILESCC(C)(C)C1CCc2onc(C(=O)Nc3cnn(Cc4ccccc4I)c3)c2C1