Reaction Details
TargetPantothenate synthetase
LigandBDBM41556
Substrate/Competitorn/a
Meas. Tech.Mycobacterium tuberculosis Pantothenate Synthetase Secondary Assay
IC50 36.3±n/a nM
Citation PubChem, PC Mycobacterium tuberculosis Pantothenate Synthetase Secondary Assay PubChem Bioassay(2007)[AID]
 
Pantothenate synthetase
Name:Pantothenate synthetase
Type:n/a
Mol. Mass.:32675.10
Organism:Mycobacterium tuberculosis (strain ATCC 25618 / H37Rv)
Description:ChEMBL_102878
Residue:309
BDBM41556
NameBDBM41556
Synonyms:5-tert-butyl-N-[1-(4-iodobenzyl)pyrazol-4-yl]indoxazene-3-carboxamide 5-tert-butyl-N-[1-[(4-iodophenyl)methyl]pyrazol-4-yl]-1,2-benzoxazole-3-carboxamide cid_16740892
TypeSmall organic molecule
Emp. Form.C22H21IN4O2
Mol. Mass.500.3322
SMILESCC(C)(C)c1ccc2onc(C(=O)Nc3cnn(Cc4ccc(I)cc4)c3)c2c1