Reaction Details
TargetP2X purinoceptor 3
LigandBDBM266170
Substrate/Competitorn/a
Meas. Tech.Human P2X3 Receptor Inhibition Assay
pH7.5±n/a
IC50 1.000±n/a nM
Commentsextracted
Citation Kai, HHoriguchi, TAsahi, KFujii, Y Triazine derivative and pharmaceutical composition having an analgesic activity comprising the same US Patent US9718790 Publication Date 8/1/2017
 
P2X purinoceptor 3
Name:P2X purinoceptor 3
Type:Protein
Mol. Mass.:44292.02
Organism:Homo sapiens (Human)
Description:P56373
Residue:397
BDBM266170
NameBDBM266170
Synonyms:US9718790, I-2157
TypeSmall organic molecule
Emp. Form.C26H24ClN5O5
Mol. Mass.521.952
SMILESCCCn1c(=O)[nH]\c(=N/c2ccc(Oc3ccc(nc3)C(=O)OC)cc2)n(Cc2ccc(Cl)cc2)c1=O