Reaction Details
TargetP2X purinoceptor 3
LigandBDBM266478
Substrate/Competitorn/a
Meas. Tech.Human P2X3 Receptor Inhibition Assay
pH7.5±n/a
IC50 2.00±n/a nM
Commentsextracted
Citation Kai, HHoriguchi, TAsahi, KFujii, Y Triazine derivative and pharmaceutical composition having an analgesic activity comprising the same US Patent US9718790 Publication Date 8/1/2017
 
P2X purinoceptor 3
Name:P2X purinoceptor 3
Type:Protein
Mol. Mass.:44292.02
Organism:Homo sapiens (Human)
Description:P56373
Residue:397
BDBM266478
NameBDBM266478
Synonyms:US9718790, I-0866
TypeSmall organic molecule
Emp. Form.C25H29ClN4O5
Mol. Mass.500.975
SMILESCCOC(=O)CCn1c(=O)[nH]\c(=N/c2ccc(OC(C)C)c(Cl)c2)n(Cc2ccc(C)cc2)c1=O