Reaction Details
TargetAlkaline phosphatase, germ cell type
LigandBDBM39645
Substrate/Competitorn/a
Meas. Tech.Luminescent assay for identification of inhibitors of human intestinal alkaline phosphatase
IC50 157±n/a nM
Citation PubChem, PC Luminescent assay for identification of inhibitors of human intestinal alkaline phosphatase PubChem Bioassay(2009)[AID]
 
Alkaline phosphatase, germ cell type
Name:Alkaline phosphatase, germ cell type
Type:PROTEIN
Mol. Mass.:57374.31
Organism:Homo sapiens (Human)
Description:ChEMBL_29964
Residue:532
BDBM39645
NameBDBM39645
Synonyms:2-(5-Phenyl-2H-[1,2,4]triazol-3-yl)-3a,4,7,7a-tetrahydro-isoindole-1,3-dione 2-(5-phenyl-1H-1,2,4-triazol-3-yl)-3a,4,7,7a-tetrahydroisoindole-1,3-quinone SMR000120899 | cid_2946732
TypeSmall organic molecule
Emp. Form.C16H14N4O2
Mol. Mass.294.308
SMILESOc1c2CC=CCc2c(O)n1-c1nnc([nH]1)-c1ccccc1