Reaction Details
TargetAlkaline phosphatase, germ cell type
LigandBDBM39626
Substrate/Competitorn/a
Meas. Tech.Luminescent assay for identification of inhibitors of human intestinal alkaline phosphatase
IC50 922±n/a nM
Citation PubChem, PC Luminescent assay for identification of inhibitors of human intestinal alkaline phosphatase PubChem Bioassay(2009)[AID]
 
Alkaline phosphatase, germ cell type
Name:Alkaline phosphatase, germ cell type
Type:PROTEIN
Mol. Mass.:57374.31
Organism:Homo sapiens (Human)
Description:ChEMBL_29964
Residue:532
BDBM39626
NameBDBM39626
Synonyms:2-(3-benzyl-1H-1,2,4-triazol-5-yl)-3a,4,7,7a-tetrahydro-1H-isoindole-1,3(2H)-dione 2-(5-benzyl-1H-1,2,4-triazol-3-yl)-3a,4,7,7a-tetrahydroisoindole-1,3-quinone MLS000100008 cid_2975791
TypeSmall organic molecule
Emp. Form.C17H16N4O2
Mol. Mass.308.3345
SMILESOc1c2CC=CCc2c(O)n1-c1nnc(Cc2ccccc2)[nH]1