Reaction Details
TargetDual specificity protein phosphatase 6
LigandBDBM31730
Substrate/Competitorn/a
Meas. Tech.MKP-3 in vitro secondary assay for identification of irreversible and slow-binding inhibitors
IC50 3400±200 nM
Citation PubChem, PC MKP-3 in vitro secondary assay for identification of irreversible and slow-binding inhibitors PubChem Bioassay(2008)[AID]
 
Dual specificity protein phosphatase 6
Name:Dual specificity protein phosphatase 6
Type:Enzyme
Mol. Mass.:42303.19
Organism:Rattus norvegicus
Description:gi_16758752
Residue:381
BDBM31730
NameBDBM31730
Synonyms:6-(4-phenylphenoxy)carbonyl-3a,4,5,9b-tetrahydro-3H-cyclopenta[c]quinoline-4-carboxylic acid MLS-0111577.0001 | cid_2901613
TypeSmall organic molecule
Emp. Form.C26H21NO4
Mol. Mass.411.4492
SMILESOC(=O)C1Nc2c(cccc2C(=O)Oc2ccc(cc2)-c2ccccc2)C2C=CCC12