Reaction Details
TargetDual specificity protein phosphatase 6
LigandBDBM31758
Substrate/Competitorn/a
Meas. Tech.MKP-3 in vitro secondary assay for identification of irreversible and slow-binding inhibitors
IC50 8000±400 nM
Citation PubChem, PC MKP-3 in vitro secondary assay for identification of irreversible and slow-binding inhibitors PubChem Bioassay(2008)[AID]
 
Dual specificity protein phosphatase 6
Name:Dual specificity protein phosphatase 6
Type:Enzyme
Mol. Mass.:42303.19
Organism:Rattus norvegicus
Description:gi_16758752
Residue:381
BDBM31758
NameBDBM31758
Synonyms:8-methyl-3a,4,5,9b-tetrahydro-3H-cyclopenta[c]quinoline-4-carboxylic acid cid_646096
TypeSmall organic molecule
Emp. Form.C14H15NO2
Mol. Mass.229.2744
SMILESCc1ccc2NC(C3CC=CC3c2c1)C(O)=O