Reaction Details
TargetMothers against decapentaplegic homolog 3
LigandBDBM41961
Substrate/Competitorn/a
Meas. Tech.SMAD Transcription Factor Inhibitors Secondary Dose Response Confirmation
IC50 12356.36607±n/a nM
Citation PubChem, PC SMAD Transcription Factor Inhibitors Secondary Dose Response Confirmation PubChem Bioassay(2008)[AID]
 
Mothers against decapentaplegic homolog 3
Name:Mothers against decapentaplegic homolog 3
Type:Enzyme Catalytic Domain
Mol. Mass.:48085.78
Organism:Homo sapiens (Human)
Description:gi_5174513
Residue:425
BDBM41961
NameBDBM41961
Synonyms:4,5,6,7-tetrachloro-3',4',5',6'-tetrahydroxy-1-spiro[isobenzofuran-3,9'-xanthene]one 4,5,6,7-tetrachloro-3',4',5',6'-tetrahydroxyspiro[2-benzofuran-3,9'-xanthene]-1-one TG2-222-2 | cid_405765
TypeSmall organic molecule
Emp. Form.C20H8Cl4O7
Mol. Mass.502.085
SMILESOc1ccc2c(Oc3c(O)c(O)ccc3C22OC(=O)c3c2c(Cl)c(Cl)c(Cl)c3Cl)c1O