Reaction Details
TargetMothers against decapentaplegic homolog 3
LigandBDBM41964
Substrate/Competitorn/a
Meas. Tech.SMAD Transcription Factor Inhibitors Secondary Dose Response Confirmation
IC50 35316.15443±n/a nM
Citation PubChem, PC SMAD Transcription Factor Inhibitors Secondary Dose Response Confirmation PubChem Bioassay(2008)[AID]
 
Mothers against decapentaplegic homolog 3
Name:Mothers against decapentaplegic homolog 3
Type:Enzyme Catalytic Domain
Mol. Mass.:48085.78
Organism:Homo sapiens (Human)
Description:gi_5174513
Residue:425
BDBM41964
NameBDBM41964
Synonyms:6-[(2-methoxyphenyl)-(4-morpholinyl)methyl]-1,3-benzodioxol-5-ol 6-[(2-methoxyphenyl)-morpholin-4-ylmethyl]-1,3-benzodioxol-5-ol NSC381579 | cid_343011
TypeSmall organic molecule
Emp. Form.C19H21NO5
Mol. Mass.343.3737
SMILESCOc1ccccc1C(N1CCOCC1)c1cc2OCOc2cc1O