Reaction Details
TargetMothers against decapentaplegic homolog 3
LigandBDBM41971
Substrate/Competitorn/a
Meas. Tech.SMAD Transcription Factor Inhibitors Secondary Dose Response Confirmation
IC50 14587.94997±n/a nM
Citation PubChem, PC SMAD Transcription Factor Inhibitors Secondary Dose Response Confirmation PubChem Bioassay(2008)[AID]
 
Mothers against decapentaplegic homolog 3
Name:Mothers against decapentaplegic homolog 3
Type:Enzyme Catalytic Domain
Mol. Mass.:48085.78
Organism:Homo sapiens (Human)
Description:gi_5174513
Residue:425
BDBM41971
NameBDBM41971
Synonyms:6-[(4-methoxyphenyl)-(1-pyrrolidinyl)methyl]-1,3-benzodioxol-5-ol 6-[(4-methoxyphenyl)-pyrrolidin-1-ylmethyl]-1,3-benzodioxol-5-ol cid_340205
TypeSmall organic molecule
Emp. Form.C19H21NO4
Mol. Mass.327.3743
SMILESCOc1ccc(cc1)C(N1CCCC1)c1cc2OCOc2cc1O