Reaction Details
TargetMothers against decapentaplegic homolog 3
LigandBDBM41982
Substrate/Competitorn/a
Meas. Tech.SMAD Transcription Factor Inhibitors Secondary Dose Response Confirmation
IC50 9658.007837±n/a nM
Citation PubChem, PC SMAD Transcription Factor Inhibitors Secondary Dose Response Confirmation PubChem Bioassay(2008)[AID]
 
Mothers against decapentaplegic homolog 3
Name:Mothers against decapentaplegic homolog 3
Type:Enzyme Catalytic Domain
Mol. Mass.:48085.78
Organism:Homo sapiens (Human)
Description:gi_5174513
Residue:425
BDBM41982
NameBDBM41982
Synonyms:6-[4-morpholinyl-(3,4,5-trimethoxyphenyl)methyl]-1,3-benzodioxol-5-ol 6-[morpholino-(3,4,5-trimethoxyphenyl)methyl]sesamol | cid_339894
TypeSmall organic molecule
Emp. Form.C21H25NO7
Mol. Mass.403.4257
SMILESCOc1cc(cc(OC)c1OC)C(N1CCOCC1)c1cc2OCOc2cc1O