Reaction Details
TargetBcl-2-related protein A1
LigandBDBM39122
Substrate/Competitorn/a
Meas. Tech.In Vitro Bfl-1 Dose Response Fluorescence Polarization Assay for SAR Study
IC50 12600±2290 nM
Citation PubChem, PC In Vitro Bfl-1 Dose Response Fluorescence Polarization Assay for SAR Study PubChem Bioassay(2008)[AID]
 
Bcl-2-related protein A1
Name:Bcl-2-related protein A1
Type:Apoptosis regulator protein
Mol. Mass.:19909.74
Organism:Mus musculus (Mouse)
Description:gi_11024684
Residue:172
BDBM39122
NameBDBM39122
Synonyms:3-chloranyl-1-(3,4-dichlorophenyl)-4-(2-methoxyethylamino)pyrrole-2,5-dione 3-chloro-1-(3,4-dichlorophenyl)-4-(2-methoxyethylamino)pyrrole-2,5-dione cid_16654626
TypeSmall organic molecule
Emp. Form.C13H11Cl3N2O3
Mol. Mass.349.597
SMILESCOCC=Nc1c(Cl)c(O)n(c1O)-c1ccc(Cl)c(Cl)c1