Reaction Details
TargetBcl-2-related protein A1
LigandBDBM39123
Substrate/Competitorn/a
Meas. Tech.In Vitro Bfl-1 Dose Response Fluorescence Polarization Assay for SAR Study
IC50 1150±250 nM
Citation PubChem, PC In Vitro Bfl-1 Dose Response Fluorescence Polarization Assay for SAR Study PubChem Bioassay(2008)[AID]
 
Bcl-2-related protein A1
Name:Bcl-2-related protein A1
Type:Apoptosis regulator protein
Mol. Mass.:19909.74
Organism:Mus musculus (Mouse)
Description:gi_11024684
Residue:172
BDBM39123
NameBDBM39123
Synonyms:3,4-bis(chloranyl)-1-(3,4-dichlorophenyl)pyrrole-2,5-dione 3,4-dichloro-1-(3,4-dichlorophenyl)pyrrole-2,5-dione cid_300953
TypeSmall organic molecule
Emp. Form.C10H3Cl4NO2
Mol. Mass.310.948
SMILESClC1=C(Cl)C(=O)N(C1=O)c1ccc(Cl)c(Cl)c1