Reaction Details
TargetBcl-2-related protein A1
LigandBDBM39124
Substrate/Competitorn/a
Meas. Tech.In Vitro Bfl-1 Dose Response Fluorescence Polarization Assay for SAR Study
IC50 419±90 nM
Citation PubChem, PC In Vitro Bfl-1 Dose Response Fluorescence Polarization Assay for SAR Study PubChem Bioassay(2008)[AID]
 
Bcl-2-related protein A1
Name:Bcl-2-related protein A1
Type:Apoptosis regulator protein
Mol. Mass.:19909.74
Organism:Mus musculus (Mouse)
Description:gi_11024684
Residue:172
BDBM39124
NameBDBM39124
Synonyms:3-chloranyl-1-(3,4-dichlorophenyl)-4-(dimethylamino)pyrrole-2,5-dione 3-chloro-1-(3,4-dichlorophenyl)-4-(dimethylamino)-3-pyrroline-2,5-quinone CHEMBL1269202 cid_779754
TypeSmall organic molecule
Emp. Form.C12H9Cl3N2O2
Mol. Mass.319.571
SMILESCN(C)C1=C(Cl)C(=O)N(C1=O)c1ccc(Cl)c(Cl)c1