Reaction Details
TargetBcl-2-related protein A1
LigandBDBM39130
Substrate/Competitorn/a
Meas. Tech.In Vitro Bfl-1 Dose Response Fluorescence Polarization Assay for SAR Study
IC50 8470±1130 nM
Citation PubChem, PC In Vitro Bfl-1 Dose Response Fluorescence Polarization Assay for SAR Study PubChem Bioassay(2008)[AID]
 
Bcl-2-related protein A1
Name:Bcl-2-related protein A1
Type:Apoptosis regulator protein
Mol. Mass.:19909.74
Organism:Mus musculus (Mouse)
Description:gi_11024684
Residue:172
BDBM39130
NameBDBM39130
Synonyms:3-chloranyl-1-(3-chlorophenyl)-4-morpholin-4-yl-pyrrole-2,5-dione 3-chloro-1-(3-chlorophenyl)-4-morpholin-4-ylpyrrole-2,5-dione MLS-0036078.0001 | cid_779063
TypeSmall organic molecule
Emp. Form.C14H12Cl2N2O3
Mol. Mass.327.163
SMILESClC1=C(N2CCOCC2)C(=O)N(C1=O)c1cccc(Cl)c1